{"text_format":"3","workbook":"xlsx","n_sheets":11,"sheets":["Cover","DCF","Model Inputs","WACC","Working Capital","3 Statements","Historical Actuals","Model Checks","Source Audit","Data Queries","Query Setup"],"not_rendered":{"defined_names":10},"read":"whole","date_system":"1900"}

{"sheet":"Cover","index":0,"n_rows":37,"n_cols":3,"rows_kept":37,"merged":[[30,1,34,5]]}
[]
[null,"DCF Valuation Model"]
[null,"Isaiah Moragne, MBA"]
[null,"Equity Valuation via Discounted Cash Flow Analysis"]
[]
[null,"Contact"]
[null,"Website:","https://isaiahmba.com"]
[null,"Email:","isaiahmoragne12@gmail.com"]
[]
[null,"How to Use"]
[null,1,"Go to the 'DCF' tab — this is the main output."]
[null,2,"Enter the ticker symbol (e.g. AAPL, MSFT) in the Ticker input cell."]
[null,3,"Refresh data: Data ribbon → Refresh All. This pulls the latest financials, treasury yield, and shares outstanding."]
[null,4,"Review assumptions on 'Model Inputs' and 'WACC' tabs — adjust growth rates, margins, or discount rate as needed."]
[null,5,"Check 'Model Checks' tab to confirm the model ties out before relying on outputs."]
[null,6,"The DCF tab shows the implied share price and upside vs. current market price."]
[]
[null,"Workbook Tabs"]
[null,"DCF","Main valuation output and summary"]
[null,"Model Inputs","Forecast assumptions (growth, margins, capex, etc.)"]
{"$rows_left_out":18}
{"sheet":"DCF","index":1,"n_rows":82,"n_cols":7,"rows_kept":82,"merged":[[0,0,0,7],[6,0,6,7],[26,0,26,7],[38,0,38,7],[51,0,51,7],[64,0,64,7],[74,0,74,7]]}
["Dynamic DCF Valuation Model"]
["Ticker","Date"]
["AAPL",{"$f":"TODAY()","v":{"v":46141,"d":"4614100.00%"}}]
["Case (1=Bear, 2=Base, 3=Bull)",2]
["Selected Case",{"$f":"IFERROR(CHOOSE($B$4,\"Bear\",\"Base\",\"Bull\"),\"INVALID\")","v":"Base"}]
[]
["VALUATION SUMMARY"]
["Sum of PV of FCFs ($)",{"$f":"SUM(C58:G58)","v":{"v":645845380691.8281,"d":"$645,845,380,692"}}]
["(+) PV of Terminal Value ($)",{"$f":"B62","v":{"v":1906614152705.526,"d":"$1,906,614,152,706"}}]
["Enterprise Value ($)",{"$f":"B8+B9","v":{"v":2552459533397.354,"d":"$2,552,459,533,397"}}]
["(-) Net Debt / (Cash) ($)",{"$f":"B22","v":{"v":54744000000,"d":"$54,744,000,000"}}]
["Equity Value ($)",{"$f":"B10+B11","v":{"v":2607203533397.354,"d":"$2,607,203,533,397"}}]
["Diluted Shares Outstanding",{"$f":"B20","v":{"v":15004697000,"d":"15,004,697,000"}}]
["Implied Share Price",{"$f":"IFERROR(B12/B13,0)","v":{"v":173.7591591084681,"d":"$173.76"}}]
["Current Share Price",{"$f":"B19","v":{"v":270.71,"d":"$270.71"}}]
["Implied Upside / (Downside)",{"$f":"IFERROR(B14/B15-1,0)","v":{"v":-0.35813542496225437,"d":"(35.8%)"}}]
[]
[]
["Current Stock Price ($)",{"$f":"'Model Inputs'!B25","v":{"v":270.71,"d":"$270.71"}}]
["Diluted Shares Outstanding",{"$f":"'Model Inputs'!B26","v":{"v":15004697000,"d":"15,004,697,000"}}]
{"$rows_left_out":63}
{"sheet":"Model Inputs","index":2,"n_rows":72,"n_cols":6,"rows_kept":72,"merged":[[0,0,0,5]]}
["Dynamic DCF Model Inputs & Controls"]
[]
["Ticker",{"$f":"DCF!A3","v":"AAPL"}]
["Valuation Date",{"$f":"DCF!B3","v":"2026-04-29"}]
[]
["Manual / Override Inputs"]
["Current Share Price ($)",0,{"$f":"IF(B7=0,FALSE,TRUE)","v":false},"Used when StockInformation Previous Close is blank or override is TRUE."]
["Diluted Shares",0,{"$f":"IF(B8=0,FALSE,TRUE)","v":false},"Fallback to latest diluted weighted average shares or EDGAR shares outstanding."]
["Base Revenue ($)",0,false,"Fallback if revenue query is blank; current AMD FY2025 revenue inferred from SEC filing."]
["Base EBIT / Operating Income ($)",0,false,"Fallback if Operating Income query is blank."]
["D&A (% Revenue)",{"v":0,"d":"0%"},false,"Fallback because current query often returns stale D&A. Edit after adding a clean cash flow query."]
["CapEx ($)",0,false,"Fallback if CapEx query is blank or stale."]
["Cash & Equivalents ($)",0,false,"Fallback if balance sheet cash query is blank."]
["Gross Debt ($)",0,false,"Override is TRUE because the current query appears to miss current debt."]
["Normalized Cash Tax Rate",{"v":0,"d":"0%"},false,"Fallback if actual tax is negative/unusual."]
["Beta",0,false,"Manual beta fallback if market-data beta is unavailable."]
["Risk-Free Rate",{"v":0,"d":"0%"},false,"Fallback if 10Y Treasury query is blank."]
["Equity Risk Premium",{"v":0.05,"d":"5%"},true,"Manual market assumption."]
["Pre-Tax Cost of Debt",{"v":0,"d":"0%"},false,"Fallback if debt cost query is negative or implausibly high."]
["NWC (% of Change in Revenue)",{"$f":"0.03","v":{"v":0.03,"d":"3.00%"}},"Manual operating working capital assumption."]
{"$rows_left_out":53}
{"sheet":"WACC","index":3,"n_rows":22,"n_cols":3,"rows_kept":22,"merged":[[0,0,0,2],[2,0,2,2],[8,0,8,2],[13,0,13,2]]}
["WACC Calculation"]
[]
["COST OF EQUITY (CAP"]
["Risk-Free Rate",{"$f":"_xlfn.LET(_xlpm.raw,IFERROR('Data Queries'!B2,\"\"),_xlpm.q,IFERROR(IF(ISNUMBER(_xlpm.raw),_xlpm.raw,_xlfn.NUMBERVALUE(SUBSTITUTE(_xlpm.raw,\"%\",\"\"))/100),0),IF(AND('Model Inputs'!$C$17,'Model Inputs'!$B$17<>0),'Model Inputs'!$B$17,IF(_xlpm.q>0,_xlpm.q,'Model Inputs'!$B$17)))","v":{"v":0.04354,"d":"4.35%"}},"10Y Treasury query, else Model Inputs B17"]
["Equity Risk Premium",{"$f":"'Model Inputs'!B18","v":{"v":0.05,"d":"5.00%"}},"Manual ERP"]
["Beta",{"$f":"_xlfn.LET(_xlpm.raw,IFERROR('Data Queries'!E11,0),_xlpm.q,IFERROR(_xlfn.NUMBERVALUE(_xlpm.raw),0),_xlpm.manual,'Model Inputs'!$B$16,IF(AND('Model Inputs'!$C$16,_xlpm.manual<>0),_xlpm.manual,IF(_xlpm.q>0,_xlpm.q,_xlpm.manual)))","v":{"v":1.11,"d":"1.110"}},"StockInformation beta, else Model Inputs B16"]
["Cost of Equity",{"$f":"B4+B6*B5","v":{"v":0.09904000000000002,"d":"9.90%"}},"Rf + beta x ERP"]
[]
["COST OF DEBT"]
["Pre-Tax Cost of Debt",{"$f":"_xlfn.LET(_xlpm.q,ABS(IFERROR(INDEX(Cost_of_Debt[Pre-Tax Cost of Debt],1),0)),_xlpm.fy,IFERROR(INDEX(Cost_of_Debt[FY],1),0),IF(AND('Model Inputs'!$C$19,'Model Inputs'!$B$19<>0),'Model Inputs'!$B$19,IF(AND(_xlpm.fy='Model Inputs'!$B$39,_xlpm.q>0,_xlpm.q<0.3),_xlpm.q,'Model Inputs'!$B$19)))","v":{"v":0,"d":"0.00%"}},"Positive query result when plausible; else manual B19"]
["Tax Rate",{"$f":"'Model Inputs'!B31","v":{"v":0.15610002335586043,"d":"15.61%"}},"Normalized tax rate"]
["After-Tax Cost of Debt",{"$f":"B10*(1-B11)","v":{"v":0,"d":"0.00%"}},"Pre-tax cost x (1-tax rate)"]
[]
["CAPITAL STRUCTURE ($)"]
["Market Cap",{"$f":"'Model Inputs'!B27","v":{"v":4000106520629.9995,"d":"$4,000,106,520,630"}},{"$f":"_xlfn.FORMULATEXT(B15)","v":"='Model Inputs'!B27"}]
["Gross Debt",{"$f":"'Model Inputs'!B35","v":{"v":90678000000,"d":"$90,678,000,000"}},"='Model Inputs'!B35"]
["Cash & Equivalents",{"$f":"'Model Inputs'!B34","v":{"v":35934000000,"d":"$35,934,000,000"}},"='Model Inputs'!B34"]
["Net Debt / (Cash)",{"$f":"'Model Inputs'!B36","v":{"v":54744000000,"d":"$54,744,000,000"}},"='Model Inputs'!B36"]
["Capital Base for Weights",{"$f":"B15+B16","v":{"v":4090784520629.9995,"d":"$4,090,784,520,630"}},"=B15+B16"]
["Equity Weight",{"$f":"IFERROR(B15/B19,0)","v":{"v":0.9778335916881696,"d":"97.78%"}},"=IFERROR(B15/B19,0)"]
{"$rows_left_out":3}
{"sheet":"Working Capital","index":4,"n_rows":15,"n_cols":2,"rows_kept":15,"merged":[[0,0,0,1]]}
["Working Capital Cross-Check"]
[]
["Item","Current Value ($)"]
["Accounts Receivable",{"$f":"_xlfn.XLOOKUP(\"Accounts Receivable, Net\",EDGAR_BalanceSheet[Line Item],EDGAR_BalanceSheet[Value (USD)],0,0)","v":{"v":39777000000,"d":"$39,777,000,000"}}]
["Inventory",{"$f":"_xlfn.XLOOKUP(\"Inventory\",EDGAR_BalanceSheet[Line Item],EDGAR_BalanceSheet[Value (USD)],0,0)","v":{"v":5718000000,"d":"$5,718,000,000"}}]
["Other Current Assets",{"$f":"_xlfn.XLOOKUP(\"Other Current Assets\",EDGAR_BalanceSheet[Line Item],EDGAR_BalanceSheet[Value (USD)],0,0)","v":{"v":47765000000,"d":"$47,765,000,000"}}]
["Accounts Payable",{"$f":"_xlfn.XLOOKUP(\"Accounts Payable\",EDGAR_BalanceSheet[Line Item],EDGAR_BalanceSheet[Value (USD)],0,0)","v":{"v":69860000000,"d":"$69,860,000,000"}}]
["Accrued Liabilities",{"$f":"_xlfn.XLOOKUP(\"Accrued Liabilities\",EDGAR_BalanceSheet[Line Item],EDGAR_BalanceSheet[Value (USD)],0,0)","v":{"v":13016000000,"d":"$13,016,000,000"}}]
["Other Current Liabilities",{"$f":"_xlfn.XLOOKUP(\"Other Current Liabilities\",EDGAR_BalanceSheet[Line Item],EDGAR_BalanceSheet[Value (USD)],0,0)","v":{"v":70405000000,"d":"$70,405,000,000"}}]
["Operating NWC",{"$f":"B4+B5+B6-B7-B8-B9","v":{"v":-60021000000,"d":"($60,021,000,000)"}}]
["Revenue",{"$f":"_xlfn.XLOOKUP(\"Total Revenue\",EDGAR_IncomeStatement[Line Item],EDGAR_IncomeStatement[Value],0,0)","v":{"v":416161000000,"d":"$416,161,000,000"}}]
["Operating NWC % Revenue",{"$f":"IFERROR(B10/B11,0)","v":{"v":-0.14422543198425608,"d":"-14.42%"}}]
["DCF NWC Assumption",{"$f":"DCF!B34","v":{"v":0.03,"d":"3.00%"}}]
[]
["Note","This is a cross-check only. The DCF still uses the explicit NWC % of revenue-change assumption unless you choose to replace it."]

{"sheet":"3 Statements","index":5,"n_rows":1,"n_cols":18,"rows_kept":1,"merged":[[0,1,0,6],[0,9,0,14],[0,17,0,22]]}
[null,"Balance Sheet",{"$nulls":7},"Income Statement",{"$nulls":7},"Statement of Cash Flows"]

{"sheet":"Historical Actuals","index":6,"n_rows":11,"n_cols":4,"rows_kept":11,"merged":[[0,0,0,3]]}
["Historical / Base Actuals"]
[]
["Metric","FY","Value","Source"]
["Revenue",{"$f":"'Model Inputs'!B39","v":2025},{"$f":"_xlfn.XLOOKUP(\"Total Revenue\",EDGAR_IncomeStatement[Line Item],EDGAR_IncomeStatement[Value],0,0)","v":{"v":416161000000,"d":"$416,161,000,000"}},"EDGAR_IncomeStatement"]
["EBIT",{"$f":"'Model Inputs'!B39","v":2025},{"$f":"_xlfn.XLOOKUP(\"Operating Income (Loss)\",EDGAR_IncomeStatement[Line Item],EDGAR_IncomeStatement[Value],0,0)","v":{"v":133050000000,"d":"$133,050,000,000"}},"EDGAR_IncomeStatement"]
["EBIT Margin",{"$f":"'Model Inputs'!B39","v":2025},{"$f":"IFERROR(C5/C4,0)","v":{"v":0.31970799762591884,"d":"31.97%"}},"Derived"]
["D&A",{"$f":"'Model Inputs'!B39","v":2025},{"$f":"_xlfn.XLOOKUP(\"Depreciation, Depletion & Amortization\",EDGAR_StatementOfCashFlows[Line Item],EDGAR_StatementOfCashFlows[Value (USD)],0,0)","v":{"v":11698000000,"d":"$11,698,000,000"}},"EDGAR_StatementOfCashFlows"]
["CapEx",{"$f":"'Model Inputs'!B39","v":2025},{"$f":"_xlfn.XLOOKUP(\"Capital Expenditures\",EDGAR_StatementOfCashFlows[Line Item],EDGAR_StatementOfCashFlows[Value (USD)],0,0)","v":{"v":12715000000,"d":"$12,715,000,000"}},"EDGAR_StatementOfCashFlows"]
["Cash",{"$f":"'Model Inputs'!B39","v":2025},{"$f":"_xlfn.XLOOKUP(\"Cash & Equivalents\",EDGAR_BalanceSheet[Line Item],EDGAR_BalanceSheet[Value (USD)],0,0)","v":{"v":35934000000,"d":"$35,934,000,000"}},"EDGAR_BalanceSheet"]
["Gross Debt",{"$f":"'Model Inputs'!B39","v":2025},{"$f":"'Model Inputs'!B35","v":{"v":90678000000,"d":"$90,678,000,000"}},"Derived from BS debt lines"]
["Diluted Shares",{"$f":"'Model Inputs'!B39","v":2025},{"$f":"'Model Inputs'!B26","v":{"v":15004697000,"d":"15,004,697,000.00"}},"EDGAR_IncomeStatement"]

{"sheet":"Model Checks","index":7,"n_rows":40,"n_cols":5,"rows_kept":40}
["Model Checks"]
[{"$f":"IF(COUNTIF(D4:D48,\"FAIL\")>0,\"FAIL\",IF(COUNTIF(D4:D48,\"WARN\")>0,\"WARN\",\"PASS\"))","v":"FAIL"}]
["Check","Value","Target / Tolerance","Status","Notes"]
["Workbook visible errors",{"$f":"SUMPRODUCT(--ISERROR(DCF!A1:L82))+SUMPRODUCT(--ISERROR(WACC!A1:C22))+SUMPRODUCT(--ISERROR('Model Inputs'!A1:F72))+SUMPRODUCT(--ISERROR('Data Queries'!A1:N60))+SUMPRODUCT(--ISERROR('3 Statements'!B1:W45))","v":0},0,{"$f":"IF(B4=0,\"PASS\",\"FAIL\")","v":"PASS"},"No visible Excel error values in core ranges."]
["Scenario selector valid",{"$f":"DCF!B4","v":2},"1, 2, or 3",{"$f":"IF(OR(B5=1,B5=2,B5=3),\"PASS\",\"FAIL\")","v":"PASS"},"DCF!B4 must select Bear, Base, or Bull."]
["Selected case resolves",{"$f":"DCF!B5","v":"Base"},"Bear / Base / Bull",{"$f":"IF(OR(B6=\"Bear\",B6=\"Base\",B6=\"Bull\"),\"PASS\",\"FAIL\")","v":"PASS"},"Prevents invalid scenario from cascading through CHOOSE formulas."]
["Current share price available",{"$f":"'Model Inputs'!B25","v":270.71},"> 0",{"$f":"IF(B7>0,\"PASS\",\"FAIL\")","v":"PASS"},"Required for market cap and implied upside/downside."]
["Diluted shares available",{"$f":"'Model Inputs'!B26","v":{"v":15004697000,"d":"15,004,697,000"}},"> 0",{"$f":"IF(B8>0,\"PASS\",\"FAIL\")","v":"PASS"},"Required for implied value per share."]
["Current shares available",{"$f":"'Model Inputs'!B40","v":{"v":14776353000,"d":"14,776,353,000"}},"> 0",{"$f":"IF(B9>0,\"PASS\",\"FAIL\")","v":"PASS"},"Required for market cap and WACC capital structure."]
["Market cap recomputes",{"$f":"'Model Inputs'!B27-('Model Inputs'!B25*'Model Inputs'!B40)","v":0},0,{"$f":"IF(ABS(B10)<1,\"PASS\",\"FAIL\")","v":"PASS"},"Market cap must equal price x current shares."]
["Base revenue available",{"$f":"'Model Inputs'!B28","v":416161000000},"> 0",{"$f":"IF(B11>0,\"PASS\",\"FAIL\")","v":"PASS"},"Revenue is the top-line projection driver."]
["Revenue source status",{"$f":"'Model Inputs'!D28","v":"OK"},"OK preferred",{"$f":"IF(B12=\"OK\",\"PASS\",IF(B12=\"INFERRED\",\"WARN\",\"FAIL\"))","v":"PASS"},"Inferred revenue can be usable but should be reviewed."]
["Base EBIT available",{"$f":"'Model Inputs'!B29","v":133050000000},"Non-zero",{"$f":"IF(B13<>0,\"PASS\",\"FAIL\")","v":"PASS"},"EBIT is required for NOPAT and free cash flow."]
["Base EBIT status",{"$f":"'Model Inputs'!D29","v":"OK"},"OK",{"$f":"IF(B14=\"OK\",\"PASS\",\"FAIL\")","v":"PASS"},"Missing EBIT must hard fail."]
["EBIT margin sane",{"$f":"'Model Inputs'!B30","v":{"v":0.31970799762591884,"d":"31.97%"}},"0% to 75%",{"$f":"IF(AND(B15>0,B15<0.75),\"PASS\",\"FAIL\")","v":"PASS"},"Detects missing EBIT, stale revenue, or non-operating company mismatch."]
["Tax rate sane",{"$f":"'Model Inputs'!B31","v":{"v":0.15610002335586043,"d":"15.61%"}},"0% to 40%",{"$f":"IF(AND(B16>0,B16<0.4),\"PASS\",\"WARN\")","v":"PASS"},"Actual tax rates outside this range need normalization review."]
["D&A percent sane",{"$f":"'Model Inputs'!B32","v":{"v":0.028109313462818475,"d":"2.81%"}},"0% to 30%",{"$f":"IF(AND(B17>0,B17<0.3),\"PASS\",\"WARN\")","v":"PASS"},"Guardrail for stale or missing D&A."]
["CapEx percent sane",{"$f":"'Model Inputs'!B33","v":{"v":0.030553079216937677,"d":"3.06%"}},"0% to 50%",{"$f":"IF(AND(B18>0,B18<0.5),\"PASS\",\"WARN\")","v":"PASS"},"Guardrail for stale or missing CapEx."]
["Cash available",{"$f":"'Model Inputs'!B34","v":35934000000},"> 0",{"$f":"IF(B19>=0,\"PASS\",\"FAIL\")","v":"PASS"},"Required for net debt bridge."]
["Debt available",{"$f":"'Model Inputs'!B35","v":90678000000},"> 0",{"$f":"IF(B20>=0,\"PASS\",\"FAIL\")","v":"PASS"},"Required for net debt and WACC weights."]
{"$rows_left_out":21}
{"sheet":"Source Audit","index":8,"n_rows":28,"n_cols":6,"rows_kept":28,"merged":[[0,0,0,5]]}
["Source Audit & Data Quality"]
[]
["Source","Key Field","Observed","Expected / Fallback","Status","Notes"]
["Income Statement","FY",{"$f":"MAX(EDGAR_IncomeStatement[FY])","v":2025},{"$f":"'Model Inputs'!B39","v":2025},{"$f":"IF(C4=D4,\"PASS\",\"FAIL\")","v":"PASS"},"Latest annual income statement year."]
["Balance Sheet","FY",{"$f":"MAX(EDGAR_BalanceSheet[FY])","v":2025},{"$f":"'Model Inputs'!B39","v":2025},{"$f":"IF(C5=D5,\"PASS\",\"FAIL\")","v":"PASS"},"Latest annual balance sheet year."]
["Cash Flow","FY",{"$f":"MAX(EDGAR_StatementOfCashFlows[FY])","v":2025},{"$f":"'Model Inputs'!B39","v":2025},{"$f":"IF(C6=D6,\"PASS\",\"FAIL\")","v":"PASS"},"Latest annual cash flow year."]
["Shares Outstanding","Shares",{"$f":"IFERROR(INDEX(EDGAR_SharesOutstanding[Shares Outstanding],1),\"\")","v":14776353000},"> 0",{"$f":"IF(C7>0,\"PASS\",\"FAIL\")","v":"PASS"},"Current shares for market cap."]
["Cost of Debt","FY / Rate",{"$f":"IFERROR(INDEX(Cost_of_Debt[FY],1)&\" / \"&IF(INDEX(Cost_of_Debt[Pre-Tax Cost of Debt],1)>0,TEXT(INDEX(Cost_of_Debt[Pre-Tax Cost of Debt],1),\"0.00%\"),\"n/a\"),\"\")","v":"2025 / n/a"},"Base FY with nonblank rate",{"$f":"IF(AND(IFERROR(INDEX(Cost_of_Debt[FY],1),0)='Model Inputs'!B39,IFERROR(INDEX(Cost_of_Debt[Pre-Tax Cost of Debt],1),0)>0),\"PASS\",\"WARN\")","v":"WARN"},"WARN means WACC uses manual B19 fallback."]
["Stock Price","Previous Close",{"$f":"'Data Queries'!E2","v":"270.71"},"> 0",{"$f":"IF(IFERROR(_xlfn.NUMBERVALUE(C9),0)>0,\"PASS\",\"FAIL\")","v":"PASS"},"Yahoo chart JSON, not HTML scrape."]
["Beta","Market beta",{"$f":"'Data Queries'!E11","v":"1.11"},"Manual beta B16",{"$f":"IF(IFERROR(_xlfn.NUMBERVALUE(C10),0)>0,\"PASS\",\"WARN\")","v":"PASS"},"WARN is acceptable when using manual beta fallback."]
["10Y Treasury","Yield",{"$f":"'Data Queries'!B2","v":"4.354%"},"> 0",{"$f":"IF(IFERROR(_xlfn.NUMBERVALUE(SUBSTITUTE(C11,\"%\",\"\")),0)>0,\"PASS\",\"FAIL\")","v":"PASS"},"Risk-free rate source."]
["Tax Rate","Actual tax / PBT",{"$f":"'Model Inputs'!B31","v":{"v":0.15610002335586043,"d":"15.61%"}},"0%-40%",{"$f":"IF(AND(C12>0,C12<0.4),\"PASS\",\"WARN\")","v":"PASS"},"Normalized tax rate control."]
["Terminal Value","Discount timing",{"$f":"'Model Inputs'!B22","v":"Year-End"},"Mid-Year / Year-End",{"$f":"IF(OR(C13=\"Mid-Year\",C13=\"Year-End\"),\"PASS\",\"FAIL\")","v":"PASS"},"Controls headline and sensitivity terminal discounting."]
[]
[]
["Refresh Diagnostics"]
[]
["Diagnostic","Observed","Expected","Status","Notes","Formula / Source"]
["Last workbook calculation",{"$f":"NOW()","v":"2026-04-29T10:25:49.170"},"Timestamp",{"$f":"IF(B19<>\"\",\"PASS\",\"FAIL\")","v":"PASS"},"Volatile timestamp for review after Refresh All.",{"$f":"NOW()","v":"2026-04-29T10:25:49.170"}]
["Ticker",{"$f":"DCF!A3","v":"AAPL"},"Nonblank",{"$f":"IF(B20<>\"\",\"PASS\",\"FAIL\")","v":"PASS"},"Ticker driving all queries.",{"$f":"DCF!A3","v":"AAPL"}]
{"$rows_left_out":9}
{"sheet":"Data Queries","index":9,"n_rows":0,"n_cols":0,"rows_kept":0}

{"sheet":"Query Setup","index":10,"n_rows":10,"n_cols":3,"rows_kept":10,"merged":[[0,0,1,2]]}
["Manual Query Setup & Overrides"]
[]
["Area","When to use","Instruction"]
["Refresh","Every model update","Use Data > Refresh All, then confirm Model Checks shows PASS or only expected WARN items."]
["Stock price","If Source Audit stock price FAILs","Enter price in Model Inputs B7 and set C7 TRUE until the query refreshes cleanly."]
["Beta","If Source Audit beta WARNs","Review/update Model Inputs B16. This is expected when Yahoo chart JSON does not provide beta."]
["Cost of debt","If Source Audit Cost of Debt WARNs","Update Model Inputs B19 and leave C19 FALSE unless you intentionally override; WACC rejects stale query years."]
["Terminal value","To change discount convention","Set Model Inputs B22 to Mid-Year or Year-End."]
["NWC","To override working capital behavior","Update Model Inputs B20; use Working Capital sheet as a reasonableness check."]
["Validation","Before relying on valuation","Check Model Checks, Source Audit, and DCF sensitivity center values."]